Reaction Details
TargetHistamine H3 receptor
LigandBDBM50158604
Substrate/Competitorn/a
Meas. Tech.ChEMBL_303685 (CHEMBL828754)
Ki 0.25±n/a nM
Citation Cowart, MFaghih, RCurtis, MPGfesser, GABennani, YLBlack, LAPan, LMarsh, KCSullivan, JPEsbenshade, TAFox, GBHancock, AA 4-(2-[2-(2(R)-methylpyrrolidin-1-yl)ethyl]benzofuran-5-yl)benzonitrile and related 2-aminoethylbenzofuran H3 receptor antagonists potently enhance cognition and attention. J Med Chem48:38-55 (2005) 
 
Histamine H3 receptor
Name:Histamine H3 receptor
Type:G Protein-Coupled Receptor (GPCR)
Mol. Mass.:48691.47
Organism:Homo sapiens (Human)
Description:Binding assays were using CHO cells stably expressing hH3R receptors.
Residue:445
BDBM50158604
NameBDBM50158604
Synonyms:1-(3-{2-[2-((R)-2-Methyl-pyrrolidin-1-yl)-ethyl]-benzofuran-5-yl}-phenyl)-propan-1-ol | CHEMBL360885
TypeSmall organic molecule
Emp. Form.C24H29NO2
Mol. Mass.363.4926
SMILESC[C@@H]1CCCN1CCc1cc2cc(ccc2o1)-c1cccc(c1)C(C)(C)O