Reaction Details
TargetHistamine H3 receptor
LigandBDBM50158590
Substrate/Competitorn/a
Meas. Tech.ChEMBL_303656 (CHEMBL829004)
Ki 0.41±n/a nM
Citation Cowart, MFaghih, RCurtis, MPGfesser, GABennani, YLBlack, LAPan, LMarsh, KCSullivan, JPEsbenshade, TAFox, GBHancock, AA 4-(2-[2-(2(R)-methylpyrrolidin-1-yl)ethyl]benzofuran-5-yl)benzonitrile and related 2-aminoethylbenzofuran H3 receptor antagonists potently enhance cognition and attention. J Med Chem48:38-55 (2005) 
 
Histamine H3 receptor
Name:Histamine H3 receptor
Type:G Protein-Coupled Receptor (GPCR)
Mol. Mass.:48607.98
Organism:Rattus norvegicus (rat)
Description:n/a
Residue:445
BDBM50158590
NameBDBM50158590
Synonyms:1-(3-{2-[2-((R)-2-Methyl-pyrrolidin-1-yl)-ethyl]-benzofuran-5-yl}-phenyl)-ethanone | CHEMBL178853
TypeSmall organic molecule
Emp. Form.C23H25NO2
Mol. Mass.347.4501
SMILESC[C@@H]1CCCN1CCc1cc2cc(ccc2o1)-c1cccc(c1)C(C)=O