Reaction Details
TargetHistamine H3 receptor
LigandBDBM22914
Substrate/Competitorn/a
Meas. Tech.ChEMBL_303656 (CHEMBL829004)
Ki 3.63±n/a nM
Citation Cowart, MFaghih, RCurtis, MPGfesser, GABennani, YLBlack, LAPan, LMarsh, KCSullivan, JPEsbenshade, TAFox, GBHancock, AA 4-(2-[2-(2(R)-methylpyrrolidin-1-yl)ethyl]benzofuran-5-yl)benzonitrile and related 2-aminoethylbenzofuran H3 receptor antagonists potently enhance cognition and attention. J Med Chem48:38-55 (2005) 
 
Histamine H3 receptor
Name:Histamine H3 receptor
Type:G Protein-Coupled Receptor (GPCR)
Mol. Mass.:48607.98
Organism:Rattus norvegicus (rat)
Description:n/a
Residue:445
BDBM22914
NameBDBM22914
Synonyms:CHEMBL260374 Thioperamide | US11622967, Compound Thioperamide
TypeSmall organic molecule
Emp. Form.C15H24N4S
Mol. Mass.292.443
SMILESS=C(NC1CCCCC1)N1CCC(CC1)c1cnc[nH]1