Reaction Details
Target5-hydroxytryptamine receptor 1A
LigandBDBM50166901
Substrate/Competitorn/a
Meas. Tech.ChEMBL_303671 (CHEMBL830432)
Ki 1.2±n/a nM
Citation Childers, WEAbou-Gharbia, MAKelly, MGAndree, THHarrison, BLHo, DMHornby, GHuryn, DMPotestio, LRosenzweig-Lipson, SJSchmid, JSmith, DLSukoff, SJZhang, GSchechter, LE Synthesis and biological evaluation of benzodioxanylpiperazine derivatives as potent serotonin 5-HT(1A) antagonists: the discovery of Lecozotan. J Med Chem48:3467-70 (2005) 
 
5-hydroxytryptamine receptor 1A
Name:5-hydroxytryptamine receptor 1A
Type:n/a
Mol. Mass.:46122.49
Organism:Homo sapiens (Human)
Description:n/a
Residue:422
BDBM50166901
NameBDBM50166901
Synonyms:4-Chloro-N-{(R)-2-[4-(2,3-dihydro-benzo[1,4]dioxin-5-yl)-piperazin-1-yl]-propyl}-N-pyridin-2-yl-benzamide | CHEMBL371149
TypeSmall organic molecule
Emp. Form.C27H29ClN4O3
Mol. Mass.492.997
SMILESC[C@H](CN(C(=O)c1ccc(Cl)cc1)c1ccccn1)N1CCN(CC1)c1cccc2OCCOc12