Reaction Details
Target5-hydroxytryptamine receptor 1A
LigandBDBM50166904
Substrate/Competitorn/a
Meas. Tech.ChEMBL_303671 (CHEMBL830432)
Ki 1±n/a nM
Citation Childers, WEAbou-Gharbia, MAKelly, MGAndree, THHarrison, BLHo, DMHornby, GHuryn, DMPotestio, LRosenzweig-Lipson, SJSchmid, JSmith, DLSukoff, SJZhang, GSchechter, LE Synthesis and biological evaluation of benzodioxanylpiperazine derivatives as potent serotonin 5-HT(1A) antagonists: the discovery of Lecozotan. J Med Chem48:3467-70 (2005) 
 
5-hydroxytryptamine receptor 1A
Name:5-hydroxytryptamine receptor 1A
Type:n/a
Mol. Mass.:46122.49
Organism:Homo sapiens (Human)
Description:n/a
Residue:422
BDBM50166904
NameBDBM50166904
Synonyms:CHEMBL193206 | N-{(R)-2-[4-(2,3-Dihydro-benzo[1,4]dioxin-5-yl)-piperazin-1-yl]-propyl}-4-nitro-N-pyridin-2-yl-benzamide
TypeSmall organic molecule
Emp. Form.C27H29N5O5
Mol. Mass.503.5497
SMILESC[C@H](CN(C(=O)c1ccc(cc1)[N+]([O-])=O)c1ccccn1)N1CCN(CC1)c1cccc2OCCOc12