Reaction Details
TargetEndolysin [L99A]
LigandBDBM50008558
Substrate/Competitorn/a
Meas. Tech.ChEMBL_302213 (CHEMBL826986)
Kd 102000±n/a nM
Citation Graves, APBrenk, RShoichet, BK Decoys for docking. J Med Chem48:3714-28 (2005) 
 
Endolysin [L99A]
Name:Endolysin [L99A]
Type:n/a
Mol. Mass.:18657.83
Organism:Enterobacteria phage T4
Description:P00720(L99A)
Residue:164
BDBM50008558
NameBDBM50008558
Synonyms:CHEMBL9113 Toluol toluene
TypeSmall organic molecule
Emp. Form.C7H8
Mol. Mass.92.1384
SMILESCc1ccccc1