Reaction Details
TargetEndolysin [L99A]
LigandBDBM50167943
Substrate/Competitorn/a
Meas. Tech.ChEMBL_302213 (CHEMBL826986)
Kd 120000±n/a nM
Citation Graves, APBrenk, RShoichet, BK Decoys for docking. J Med Chem48:3714-28 (2005) 
 
Endolysin [L99A]
Name:Endolysin [L99A]
Type:n/a
Mol. Mass.:18657.83
Organism:Enterobacteria phage T4
Description:P00720(L99A)
Residue:164
BDBM50167943
NameBDBM50167943
Synonyms:1-Ethyl-4-methyl-benzene | CHEMBL195384
TypeSmall organic molecule
Emp. Form.C9H12
Mol. Mass.120.1916
SMILESCCc1ccc(C)cc1