Reaction Details
TargetEndolysin [L99A]
LigandBDBM50167948
Substrate/Competitorn/a
Meas. Tech.ChEMBL_302213 (CHEMBL826986)
Kd 74000±n/a nM
Citation Graves, APBrenk, RShoichet, BK Decoys for docking. J Med Chem48:3714-28 (2005) 
 
Endolysin [L99A]
Name:Endolysin [L99A]
Type:n/a
Mol. Mass.:18657.83
Organism:Enterobacteria phage T4
Description:P00720(L99A)
Residue:164
BDBM50167948
NameBDBM50167948
Synonyms:1-benzothiophene CHEMBL87112 benzothiofuran | thianaphthene
TypeSmall organic molecule
Emp. Form.C8H6S
Mol. Mass.134.198
SMILESc1cc2ccccc2s1