Reaction Details
TargetNeutrophil elastase
LigandBDBM50171301
Substrate/Competitorn/a
Meas. Tech.ChEMBL_302686 (CHEMBL839448)
Ki 2900±n/a nM
Citation Venkatraman, SNjoroge, FGGirijavallabhan, VMMadison, VSYao, NHProngay, AJButkiewicz, NPichardo, J Design and synthesis of depeptidized macrocyclic inhibitors of hepatitis C NS3-4A protease using structure-based drug design. J Med Chem48:5088-91 (2005) 
 
Neutrophil elastase
Name:Neutrophil elastase
Type:Enzyme
Mol. Mass.:28532.38
Organism:Homo sapiens (Human)
Description:P08246
Residue:267
BDBM50171301
NameBDBM50171301
Synonyms:(S)-(2-{3-[((9S,12S)-12-Cyclohexyl-11,14-dioxo-2-oxa-10,13-diaza-tricyclo[15.2.2.1*3,7*]docosa-1(20),3(22),4,6,17(21),18-hexaene-9-carbonyl)-amino]-2-oxo-hexanoylamino}-acetylamino)-phenyl-acetic acid | CHEMBL189159
TypeSmall organic molecule
Emp. Form.C42H49N5O9
Mol. Mass.767.8666
SMILESCCC[C@H](NC(=O)[C@@H]1Cc2cccc(Oc3ccc(CCC(=O)N[C@@H](C4CCCCC4)C(=O)N1)cc3)c2)C(=O)C(=O)NCC(=O)N[C@H](C(O)=O)c1ccccc1