Reaction Details
TargetGenome polyprotein
LigandBDBM50171302
Substrate/Competitorn/a
Meas. Tech.ChEMBL_303773 (CHEMBL830130)
Ki 300±n/a nM
Citation Venkatraman, SNjoroge, FGGirijavallabhan, VMMadison, VSYao, NHProngay, AJButkiewicz, NPichardo, J Design and synthesis of depeptidized macrocyclic inhibitors of hepatitis C NS3-4A protease using structure-based drug design. J Med Chem48:5088-91 (2005) 
 
Genome polyprotein
Name:Genome polyprotein
Type:Protein
Mol. Mass.:67067.41
Organism:Hepatitis C virus
Description:A3EZI9
Residue:631
BDBM50171302
NameBDBM50171302
Synonyms:(S)-(2-{3-[((9S,12S)-12-Cyclohexyl-11,14-dioxo-2-oxa-10,13-diaza-tricyclo[17.2.2.1*3,7*]tetracosa-1(22),3(24),4,6,19(23),20-hexaene-9-carbonyl)-amino]-2-oxo-hexanoylamino}-acetylamino)-phenyl-acetic acid | CHEMBL190306
TypeSmall organic molecule
Emp. Form.C44H53N5O9
Mol. Mass.795.9197
SMILESCCC[C@H](NC(=O)[C@@H]1Cc2cccc(Oc3ccc(CCCCC(=O)N[C@@H](C4CCCCC4)C(=O)N1)cc3)c2)C(=O)C(=O)NCC(=O)N[C@H](C(O)=O)c1ccccc1