Reaction Details
TargetEndothelin-converting enzyme 1
LigandBDBM50159366
Substrate/Competitorn/a
Meas. Tech.ChEMBL_305797 (CHEMBL827985)
IC50 6.90±n/a nM
Citation Berger, YDehmlow, HBlum-Kaelin, DKitas, EALöffler, BMAebi, JDJuillerat-Jeanneret, L Endothelin-converting enzyme-1 inhibition and growth of human glioblastoma cells. J Med Chem48:483-98 (2005) 
 
Endothelin-converting enzyme 1
Name:Endothelin-converting enzyme 1
Type:Enzyme
Mol. Mass.:87155.11
Organism:Homo sapiens (Human)
Description:P42892
Residue:770
BDBM50159366
NameBDBM50159366
Synonyms:(2S,4R)-4-Acetylsulfanyl-2-(2,4,5-trifluoro-benzyloxymethyl)-pyrrolidine-1-carboxylic acid 2,3-dihydro-benzo[1,4]dioxin-5-yl ester | CHEMBL191879
TypeSmall organic molecule
Emp. Form.C23H22F3NO6S
Mol. Mass.497.484
SMILESCC(=O)S[C@@H]1C[C@@H](COCc2cc(F)c(F)cc2F)N(C1)C(=O)Oc1cccc2OCCOc12