Reaction Details
TargetEndothelin-converting enzyme 1
LigandBDBM50159364
Substrate/Competitorn/a
Meas. Tech.ChEMBL_305832 (CHEMBL829574)
IC50 1090±n/a nM
Citation Berger, YDehmlow, HBlum-Kaelin, DKitas, EALöffler, BMAebi, JDJuillerat-Jeanneret, L Endothelin-converting enzyme-1 inhibition and growth of human glioblastoma cells. J Med Chem48:483-98 (2005) 
 
Endothelin-converting enzyme 1
Name:Endothelin-converting enzyme 1
Type:Enzyme
Mol. Mass.:87155.11
Organism:Homo sapiens (Human)
Description:P42892
Residue:770
BDBM50159364
NameBDBM50159364
Synonyms:CHEMBL192441 | isopropyl (2S,4R)-2-{[(2,5-difluorobenzyl)amino]methyl}-4-mercaptopyrrolidine-1-carboxylate
TypeSmall organic molecule
Emp. Form.C16H22F2N2O2S
Mol. Mass.344.42
SMILESCC(C)OC(=O)N1C[C@H](S)CC1CNCc1cc(F)ccc1F