Reaction Details
TargetSolute carrier family 15 member 1
LigandBDBM50370608
Substrate/Competitorn/a
Meas. Tech.ChEMBL_306462 (CHEMBL829539)
IC50 166000±n/a nM
Citation Song, XVig, BSLorenzi, PLDrach, JCTownsend, LBAmidon, GL Amino acid ester prodrugs of the antiviral agent 2-bromo-5,6-dichloro-1-(beta-D-ribofuranosyl)benzimidazole as potential substrates of hPEPT1 transporter. J Med Chem48:1274-7 (2005) 
 
Solute carrier family 15 member 1
Name:Solute carrier family 15 member 1
Type:PROTEIN
Mol. Mass.:78818.07
Organism:Homo sapiens (Human)
Description:ChEMBL_1488839
Residue:708
BDBM50370608
NameBDBM50370608
Synonyms:CHEMBL607668
TypeSmall organic molecule
Emp. Form.C17H20BrCl2N3O5
Mol. Mass.497.168
SMILESCC(C)[C@H](N)C(=O)OC[C@H]1OC([C@H](O)[C@@H]1O)n1c(Br)nc2cc(Cl)c(Cl)cc12