Reaction Details
TargetSolute carrier family 15 member 1
LigandBDBM50370614
Substrate/Competitorn/a
Meas. Tech.ChEMBL_306462 (CHEMBL829539)
IC50 96000±n/a nM
Citation Song, XVig, BSLorenzi, PLDrach, JCTownsend, LBAmidon, GL Amino acid ester prodrugs of the antiviral agent 2-bromo-5,6-dichloro-1-(beta-D-ribofuranosyl)benzimidazole as potential substrates of hPEPT1 transporter. J Med Chem48:1274-7 (2005) 
 
Solute carrier family 15 member 1
Name:Solute carrier family 15 member 1
Type:PROTEIN
Mol. Mass.:78818.07
Organism:Homo sapiens (Human)
Description:ChEMBL_1488839
Residue:708
BDBM50370614
NameBDBM50370614
Synonyms:CHEMBL608788
TypeSmall organic molecule
Emp. Form.C23H24BrCl2N3O6
Mol. Mass.589.263
SMILESCCOc1ccc(C[C@H](N)C(=O)OC[C@H]2OC([C@H](O)[C@@H]2O)n2c(Br)nc3cc(Cl)c(Cl)cc23)cc1