Reaction Details
TargetMelanocortin receptor 3
LigandBDBM50017181
Substrate/Competitorn/a
Meas. Tech.ChEMBL_310780 (CHEMBL834875)
EC50 0.800000±n/a nM
Citation Cai, MMayorov, AVCabello, CStankova, MTrivedi, DHruby, VJ Novel 3D pharmacophore of alpha-MSH/gamma-MSH hybrids leads to selective human MC1R and MC3R analogues. J Med Chem48:1839-48 (2005) 
 
Melanocortin receptor 3
Name:Melanocortin receptor 3
Type:Enzyme
Mol. Mass.:36044.86
Organism:Homo sapiens (Human)
Description:P41968
Residue:323
BDBM50017181
NameBDBM50017181
Synonyms:CHEMBL441738
TypeSmall organic molecule
Emp. Form.C78H111N21O19
Mol. Mass.1646.8452
SMILESCCCC[C@H](NC(=O)[C@H](CO)NC(=O)[C@H](Cc1ccc(O)cc1)NC(=O)[C@H](CO)NC(C)=O)C(=O)N[C@@H](CCC(O)=O)C(=O)N[C@@H](Cc1cnc[nH]1)C(=O)N[C@H](Cc1ccccc1)C(=O)N[C@@H](CCCNC(N)=N)C(=O)N[C@@H](Cc1c[nH]c2ccccc12)C(=O)NCC(=O)N[C@@H](CCCCN)C(=O)N1CCC[C@H]1C(=O)N[C@@H](C(C)C)C(N)=O