Reaction Details
TargetMelanocortin receptor 5
LigandBDBM50163145
Substrate/Competitorn/a
Meas. Tech.ChEMBL_304660 (CHEMBL827861)
IC50 3.5±n/a nM
Citation Cai, MMayorov, AVCabello, CStankova, MTrivedi, DHruby, VJ Novel 3D pharmacophore of alpha-MSH/gamma-MSH hybrids leads to selective human MC1R and MC3R analogues. J Med Chem48:1839-48 (2005) 
 
Melanocortin receptor 5
Name:Melanocortin receptor 5
Type:Enzyme
Mol. Mass.:36612.92
Organism:Homo sapiens (Human)
Description:P33032
Residue:325
BDBM50163145
NameBDBM50163145
Synonyms:CHEMBL413439 | H-Tyr-Val-Nle-Gly-His-D-Nal(2'')-Arg-D-Trp-Asp-Arg-Phe-Gly-NH2
TypeSmall organic molecule
Emp. Form.C79H103N21O16
Mol. Mass.1602.7942
SMILESCCCC[C@H](NC(=O)[C@@H](NC(=O)[C@@H](N)Cc1ccc(O)cc1)C(C)C)C(=O)NCC(=O)N[C@@H](Cc1cnc[nH]1)C(=O)N[C@H](Cc1ccc2ccccc2c1)C(=O)N[C@@H](CCCNC(N)=N)C(=O)N[C@@H](Cc1c[nH]c2ccccc12)C(=O)N[C@@H](CC(O)=O)C(=O)N[C@@H](CCCNC(N)=N)C(=O)N[C@@H](Cc1ccccc1)C(=O)NCC(O)=O