Reaction Details
TargetMelanocyte-stimulating hormone receptor
LigandBDBM50163145
Substrate/Competitorn/a
Meas. Tech.ChEMBL_306266 (CHEMBL828399)
IC50 0.300000±n/a nM
Citation Cai, MMayorov, AVCabello, CStankova, MTrivedi, DHruby, VJ Novel 3D pharmacophore of alpha-MSH/gamma-MSH hybrids leads to selective human MC1R and MC3R analogues. J Med Chem48:1839-48 (2005) 
 
Melanocyte-stimulating hormone receptor
Name:Melanocyte-stimulating hormone receptor
Type:Enzyme
Mol. Mass.:34717.23
Organism:Homo sapiens (Human)
Description:Q01726
Residue:317
BDBM50163145
NameBDBM50163145
Synonyms:CHEMBL413439 | H-Tyr-Val-Nle-Gly-His-D-Nal(2'')-Arg-D-Trp-Asp-Arg-Phe-Gly-NH2
TypeSmall organic molecule
Emp. Form.C79H103N21O16
Mol. Mass.1602.7942
SMILESCCCC[C@H](NC(=O)[C@@H](NC(=O)[C@@H](N)Cc1ccc(O)cc1)C(C)C)C(=O)NCC(=O)N[C@@H](Cc1cnc[nH]1)C(=O)N[C@H](Cc1ccc2ccccc2c1)C(=O)N[C@@H](CCCNC(N)=N)C(=O)N[C@@H](Cc1c[nH]c2ccccc12)C(=O)N[C@@H](CC(O)=O)C(=O)N[C@@H](CCCNC(N)=N)C(=O)N[C@@H](Cc1ccccc1)C(=O)NCC(O)=O