Reaction Details
TargetcGMP-specific 3',5'-cyclic phosphodiesterase
LigandBDBM50163573
Substrate/Competitorn/a
Meas. Tech.ChEMBL_303177 (CHEMBL829671)
Ki 0.019±n/a nM
Citation Jiang, WGuan, JMacielag, MJZhang, SQiu, YKraft, PBhattacharjee, SJohn, TMHaynes-Johnson, DLundeen, SSui, Z Pyrroloquinolone PDE5 inhibitors with improved pharmaceutical profiles for clinical studies on erectile dysfunction. J Med Chem48:2126-33 (2005) 
 
cGMP-specific 3',5'-cyclic phosphodiesterase
Name:cGMP-specific 3',5'-cyclic phosphodiesterase
Type:PROTEIN
Mol. Mass.:94547.60
Organism:Rattus norvegicus
Description:ChEMBL_155367
Residue:833
BDBM50163573
NameBDBM50163573
Synonyms:(R)-3-(2,3-Dihydro-benzofuran-5-yl)-2-(5-pyridin-2-yl-pyrimidin-2-yl)-1,2,3,4-tetrahydro-pyrrolo[3,4-b]quinolin-9-one | CHEMBL425690
TypeSmall organic molecule
Emp. Form.C28H21N5O2
Mol. Mass.459.4986
SMILESOc1c2CN([C@@H](c2nc2ccccc12)c1ccc2OCCc2c1)c1ncc(cn1)-c1ccccn1