Reaction Details
TargetKappa-type opioid receptor
LigandBDBM50166216
Substrate/Competitorn/a
Meas. Tech.ChEMBL_303452 (CHEMBL839712)
Ki 1.18±n/a nM
Citation Lattanzi, RSpetea, MSchüllner, FRief, SBKrassnig, RNegri, LSchmidhammer, H Synthesis and biological evaluation of 14-alkoxymorphinans. 22.(1) Influence of the 14-alkoxy group and the substitution in position 5 in 14-alkoxymorphinan-6-ones on in vitro and in vivo activities. J Med Chem48:3372-8 (2005) 
 
Kappa-type opioid receptor
Name:Kappa-type opioid receptor
Type:G Protein-Coupled Receptor (GPCR)
Mol. Mass.:42744.99
Organism:Cavia porcellus (domestic guinea pig)
Description:P41144
Residue:380
BDBM50166216
NameBDBM50166216
Synonyms:17-benzyloxy-10-hydroxy-4-methyl-(13R,17S)-12-oxa-4-azapentacyclo[9.6.1.01,13.05,17.07,18]octadeca-7(18),8,10-trien-14-one
TypeSmall organic molecule
Emp. Form.C24H25NO4
Mol. Mass.391.4596
SMILESCN1CC[C@@]23[C@H]4Oc5c2c(CC1[C@@]3(CCC4=O)OCc1ccccc1)ccc5O