Reaction Details
TargetMu-type opioid receptor
LigandBDBM50166215
Substrate/Competitorn/a
Meas. Tech.ChEMBL_303276 (CHEMBL828270)
Ki 0.18±n/a nM
Citation Lattanzi, RSpetea, MSchüllner, FRief, SBKrassnig, RNegri, LSchmidhammer, H Synthesis and biological evaluation of 14-alkoxymorphinans. 22.(1) Influence of the 14-alkoxy group and the substitution in position 5 in 14-alkoxymorphinan-6-ones on in vitro and in vivo activities. J Med Chem48:3372-8 (2005) 
 
Mu-type opioid receptor
Name:Mu-type opioid receptor
Type:G Protein-Coupled Receptor (GPCR)
Mol. Mass.:44503.11
Organism:Rattus norvegicus (rat)
Description:Competition binding assays were carried out using membrane preparations from transfected HN9.10 cells that constitutively expressed the mu opioid receptor.
Residue:398
BDBM50166215
NameBDBM50166215
Synonyms:17-benzyloxy-10-hydroxy-4,13-dimethyl-(13R,17S)-12-oxa-4-azapentacyclo[9.6.1.01,13.05,17.07,18]octadeca-7(18),8,10-trien-14-one
TypeSmall organic molecule
Emp. Form.C25H27NO4
Mol. Mass.405.4862
SMILESCN1CC[C@]23c4c5O[C@@]2(C)C(=O)CC[C@@]3(OCc2ccccc2)C1Cc4ccc5O