Reaction Details
TargetNeuronal acetylcholine receptor subunit alpha-4/beta-2
LigandBDBM50174174
Substrate/Competitorn/a
Meas. Tech.ChEMBL_320951 (CHEMBL882470)
Ki 0.55±n/a nM
Citation Coe, JWBrooks, PRWirtz, MCBashore, CGBianco, KEVetelino, MGArnold, EPLebel, LAFox, CBTingley, FDSchulz, DWDavis, TISands, SBMansbach, RSRollema, HO'Neill, BT 3,5-Bicyclic aryl piperidines: a novel class of alpha4beta2 neuronal nicotinic receptor partial agonists for smoking cessation. Bioorg Med Chem Lett15:4889-97 (2005) 
 
Neuronal acetylcholine receptor subunit alpha-4/beta-2
Name:Neuronal acetylcholine receptor subunit alpha-4/beta-2
Type:Protein
Mol. Mass.:n/a
Description:n/a
Components:This complex has 2 components.
Component 1
Name:Neuronal acetylcholine receptor subunit alpha-4
Synonyms:ACHA4_HUMAN CHRNA4 protein Neuronal acetylcholine receptor protein alpha-4 subunit Nicotinic acetylcholine receptor alpha4/beta2/alpha5
Type:n/a
Mol. Mass.:69963.49
Organism:Homo sapiens (Human)
Description:NACHRA4
Residue:627
Component 2
Name:Neuronal acetylcholine receptor subunit beta-2
Synonyms:ACHB2_HUMAN Neuronal acetylcholine receptor protein beta-2 subunit | Nicotinic acetylcholine receptor alpha3/beta2/alpha5
Type:Protein
Mol. Mass.:57020.50
Organism:Homo sapiens (Human)
Description:P17787
Residue:502
BDBM50174174
NameBDBM50174174
Synonyms:6,7-dimethyl-5,8,14-triazatetracyclo[10.3.1.02,11.04,9]hexadeca-2(11),3,5,7,9-pentaene | CHEMBL198278
TypeSmall organic molecule
Emp. Form.C15H17N3
Mol. Mass.239.3156
SMILESCc1nc2cc3C4CC(CNC4)c3cc2nc1C