Reaction Details
TargetPeroxisome proliferator-activated receptor delta
LigandBDBM50172358
Substrate/Competitorn/a
Meas. Tech.ChEMBL_321091 (CHEMBL883694)
EC50 1000±n/a nM
Citation Nicolaou, KC Joys of molecules. 2. Endeavors in chemical biology and medicinal chemistry. J Med Chem48:5613-38 (2005) 
 
Peroxisome proliferator-activated receptor delta
Name:Peroxisome proliferator-activated receptor delta
Type:Enzyme
Mol. Mass.:49910.45
Organism:Homo sapiens (Human)
Description:Q03181
Residue:441
BDBM50172358
NameBDBM50172358
Synonyms:Biphenyl-4-carboxylic acid (2,2-dimethyl-2H-chromen-8-ylmethyl)-isopropyl-amide | CHEMBL193426
TypeSmall organic molecule
Emp. Form.C28H29NO2
Mol. Mass.411.5354
SMILESCC(C)N(Cc1cccc2C=CC(C)(C)Oc12)C(=O)c1ccc(cc1)-c1ccccc1