Reaction Details
TargetCytochrome c oxidase subunit NDUFA4
LigandBDBM50172381
Substrate/Competitorn/a
Meas. Tech.ChEMBL_321337 (CHEMBL880621)
IC50 55±n/a nM
Citation Nicolaou, KC Joys of molecules. 2. Endeavors in chemical biology and medicinal chemistry. J Med Chem48:5613-38 (2005) 
 
Cytochrome c oxidase subunit NDUFA4
Name:Cytochrome c oxidase subunit NDUFA4
Type:PROTEIN
Mol. Mass.:9374.28
Organism:Homo sapiens (Human)
Description:ChEMBL_321338
Residue:81
BDBM50172381
NameBDBM50172381
Synonyms:2,2-Dimethyl-2H-chromene-6-carboxylic acid 3,4,5-trimethoxy-benzyl ester | CHEMBL370213
TypeSmall organic molecule
Emp. Form.C22H24O6
Mol. Mass.384.4224
SMILESCOc1cc(COC(=O)c2ccc3OC(C)(C)C=Cc3c2)cc(OC)c1OC