Reaction Details
TargetSodium-dependent dopamine transporter
LigandBDBM22416
Substrate/Competitorn/a
Meas. Tech.ChEMBL_320794 (CHEMBL884749)
Ki 400±n/a nM
Citation Mattson, RJCatt, JDDenhart, DJDeskus, JADitta, JLHiggins, MAMarcin, LRSloan, CPBeno, BRGao, QCunningham, MAMattson, GKMolski, TFTaber, MTLodge, NJ Conformationally restricted homotryptamines. 2. Indole cyclopropylmethylamines as selective serotonin reuptake inhibitors. J Med Chem48:6023-34 (2005) 
 
Sodium-dependent dopamine transporter
Name:Sodium-dependent dopamine transporter
Type:Multi-pass membrane protein
Mol. Mass.:68497.11
Organism:Homo sapiens (Human)
Description:Q01959
Residue:620
BDBM22416
NameBDBM22416
Synonyms:(3S,4R)-3-[(1,3-benzodioxol-5-yloxy)methyl]-4-(4-fluorophenyl)piperidine CHEMBL490 US09969700, Paroxetine [3H]Paroxetine
Typeradiolabeled ligand
Emp. Form.C19H20FNO3
Mol. Mass.329.3654
SMILESFc1ccc(cc1)[C@@H]1CCNC[C@H]1COc1ccc2OCOc2c1