Reaction Details
TargetSodium-dependent serotonin transporter
LigandBDBM50173714
Substrate/Competitorn/a
Meas. Tech.ChEMBL_320797 (CHEMBL884752)
Ki 10±n/a nM
Citation Mattson, RJCatt, JDDenhart, DJDeskus, JADitta, JLHiggins, MAMarcin, LRSloan, CPBeno, BRGao, QCunningham, MAMattson, GKMolski, TFTaber, MTLodge, NJ Conformationally restricted homotryptamines. 2. Indole cyclopropylmethylamines as selective serotonin reuptake inhibitors. J Med Chem48:6023-34 (2005) 
 
Sodium-dependent serotonin transporter
Name:Sodium-dependent serotonin transporter
Type:Multi-pass membrane protein
Mol. Mass.:70322.51
Organism:Homo sapiens (Human)
Description:P31645
Residue:630
BDBM50173714
NameBDBM50173714
Synonyms:CHEMBL364050 | [(1S,2S)-2-(7-Fluoro-1H-indol-3-yl)-cyclopropylmethyl]-dimethyl-amine
TypeSmall organic molecule
Emp. Form.C14H17FN2
Mol. Mass.232.2966
SMILESCN(C)C[C@H]1C[C@@H]1c1c[nH]c2c(F)cccc12