Reaction Details
TargetSodium-dependent noradrenaline transporter
LigandBDBM50173715
Substrate/Competitorn/a
Meas. Tech.ChEMBL_320832 (CHEMBL871674)
Ki 4600±n/a nM
Citation Mattson, RJCatt, JDDenhart, DJDeskus, JADitta, JLHiggins, MAMarcin, LRSloan, CPBeno, BRGao, QCunningham, MAMattson, GKMolski, TFTaber, MTLodge, NJ Conformationally restricted homotryptamines. 2. Indole cyclopropylmethylamines as selective serotonin reuptake inhibitors. J Med Chem48:6023-34 (2005) 
 
Sodium-dependent noradrenaline transporter
Name:Sodium-dependent noradrenaline transporter
Type:Multi-pass membrane protein
Mol. Mass.:69337.72
Organism:Homo sapiens (Human)
Description:P23975
Residue:617
BDBM50173715
NameBDBM50173715
Synonyms:(+)3-((1S,2S)-2-Dimethylaminomethyl-cyclopropyl)-1H-indole-5-carbonitrile 3-((1S,2S)-2-Dimethylaminomethyl-cyclopropyl)-1H-indole-5-carbonitrile | CHEMBL196468
TypeSmall organic molecule
Emp. Form.C15H17N3
Mol. Mass.239.3156
SMILESCN(C)C[C@H]1C[C@@H]1c1c[nH]c2ccc(cc12)C#N