Reaction Details
TargetSodium-dependent serotonin transporter
LigandBDBM50162700
Substrate/Competitorn/a
Meas. Tech.ChEMBL_320797 (CHEMBL884752)
Ki 2±n/a nM
Citation Mattson, RJCatt, JDDenhart, DJDeskus, JADitta, JLHiggins, MAMarcin, LRSloan, CPBeno, BRGao, QCunningham, MAMattson, GKMolski, TFTaber, MTLodge, NJ Conformationally restricted homotryptamines. 2. Indole cyclopropylmethylamines as selective serotonin reuptake inhibitors. J Med Chem48:6023-34 (2005) 
 
Sodium-dependent serotonin transporter
Name:Sodium-dependent serotonin transporter
Type:Multi-pass membrane protein
Mol. Mass.:70322.51
Organism:Homo sapiens (Human)
Description:P31645
Residue:630
BDBM50162700
NameBDBM50162700
Synonyms:3-(3-(dimethylamino)propyl)-1H-indole-5-carbonitrile CHEMBL180630
TypeSmall organic molecule
Emp. Form.C14H17N3
Mol. Mass.227.3049
SMILESCN(C)CCCc1c[nH]c2ccc(cc12)C#N