Reaction Details
TargetGlutamine synthetase
LigandBDBM50174523
Substrate/Competitorn/a
Meas. Tech.ChEMBL_320773 (CHEMBL884728)
Ki 590±n/a nM
Citation Berlicki, LObojska, AForlani, GKafarski, P Design, synthesis, and activity of analogues of phosphinothricin as inhibitors of glutamine synthetase. J Med Chem48:6340-9 (2005) 
 
Glutamine synthetase
Name:Glutamine synthetase
Type:PROTEIN
Mol. Mass.:51891.08
Organism:Escherichia coli (strain K12)
Description:ChEMBL_321474
Residue:469
BDBM50174523
NameBDBM50174523
Synonyms:(S)-2-Amino-4-(aminomethyl-hydroxy-phosphinoyl)-butyric acid; dihydrochloride | CHEMBL536046
TypeSmall organic molecule
Emp. Form.C5H13N2O4P
Mol. Mass.196.1415
SMILESN[C@@H](CCP(O)(O)C=N)C(O)=O