Reaction Details
TargetGlutamine synthetase
LigandBDBM50174527
Substrate/Competitorn/a
Meas. Tech.ChEMBL_320773 (CHEMBL884728)
Ki 600±n/a nM
Citation Berlicki, LObojska, AForlani, GKafarski, P Design, synthesis, and activity of analogues of phosphinothricin as inhibitors of glutamine synthetase. J Med Chem48:6340-9 (2005) 
 
Glutamine synthetase
Name:Glutamine synthetase
Type:PROTEIN
Mol. Mass.:51891.08
Organism:Escherichia coli (strain K12)
Description:ChEMBL_321474
Residue:469
BDBM50174527
NameBDBM50174527
Synonyms:(S)-2-Amino-4-(hydroxy-methyl-phosphinoyl)-butyric acid; hydrochloride CHEMBL535153
TypeSmall organic molecule
Emp. Form.C5H12NO4P
Mol. Mass.181.1268
SMILESCP(O)(=O)CC[C@H](N)C(O)=O