Reaction Details
TargetGuanine nucleotide-binding protein G(i) subunit alpha-3
LigandBDBM50174643
Substrate/Competitorn/a
Meas. Tech.ChEMBL_321105 (CHEMBL882871)
EC50 8050300±n/a nM
Citation Manetti, DDi Cesare Mannelli, LDei, SGaleotti, NGhelardini, CRomanelli, MNScapecchi, STeodori, EPacini, ABartolini, AGualtieri, F Design, synthesis, and preliminary pharmacological evaluation of a set of small molecules that directly activate gi proteins. J Med Chem48:6491-503 (2005) 
 
Guanine nucleotide-binding protein G(i) subunit alpha-3
Name:Guanine nucleotide-binding protein G(i) subunit alpha-3
Type:PROTEIN
Mol. Mass.:40527.21
Organism:Homo sapiens (Human)
Description:ChEMBL_321105
Residue:354
BDBM50174643
NameBDBM50174643
Synonyms:1-Pentadecyl-4-(2-piperidin-4-yl-ethyl)-piperidine; dihydrochloride | CHEMBL534482
TypeSmall organic molecule
Emp. Form.C27H54N2
Mol. Mass.406.7311
1CCC(CCC2CCNCC2)CC1