Reaction Details
TargetGuanine nucleotide-binding protein G(i) subunit alpha-3
LigandBDBM50174648
Substrate/Competitorn/a
Meas. Tech.ChEMBL_321105 (CHEMBL882871)
EC50 5900±n/a nM
Citation Manetti, DDi Cesare Mannelli, LDei, SGaleotti, NGhelardini, CRomanelli, MNScapecchi, STeodori, EPacini, ABartolini, AGualtieri, F Design, synthesis, and preliminary pharmacological evaluation of a set of small molecules that directly activate gi proteins. J Med Chem48:6491-503 (2005) 
 
Guanine nucleotide-binding protein G(i) subunit alpha-3
Name:Guanine nucleotide-binding protein G(i) subunit alpha-3
Type:PROTEIN
Mol. Mass.:40527.21
Organism:Homo sapiens (Human)
Description:ChEMBL_321105
Residue:354
BDBM50174648
NameBDBM50174648
Synonyms:CHEMBL536499 | Piperidine-4-carboxylic acid pentadecylamide; hydrochloride
TypeSmall organic molecule
Emp. Form.C21H42N2O
Mol. Mass.338.571
(=O)C1CCNCC1