Reaction Details
TargetGuanine nucleotide-binding protein G(o) subunit alpha
LigandBDBM50174649
Substrate/Competitorn/a
Meas. Tech.ChEMBL_321106 (CHEMBL882872)
EC50 22600±n/a nM
Citation Manetti, DDi Cesare Mannelli, LDei, SGaleotti, NGhelardini, CRomanelli, MNScapecchi, STeodori, EPacini, ABartolini, AGualtieri, F Design, synthesis, and preliminary pharmacological evaluation of a set of small molecules that directly activate gi proteins. J Med Chem48:6491-503 (2005) 
 
Guanine nucleotide-binding protein G(o) subunit alpha
Name:Guanine nucleotide-binding protein G(o) subunit alpha
Type:PROTEIN
Mol. Mass.:40043.59
Organism:Homo sapiens (Human)
Description:ChEMBL_321106
Residue:354
BDBM50174649
NameBDBM50174649
Synonyms:1-[4,4']Bipiperidinyl-1-yl-heptadecan-1-one; hydrochloride | CHEMBL535378
TypeSmall organic molecule
Emp. Form.C27H52N2O
Mol. Mass.420.7146
(=O)N1CCC(CC1)C1CCNCC1