Reaction Details
TargetGuanine nucleotide-binding protein G(o) subunit alpha
LigandBDBM50174643
Substrate/Competitorn/a
Meas. Tech.ChEMBL_321106 (CHEMBL882872)
EC50 10500±n/a nM
Citation Manetti, DDi Cesare Mannelli, LDei, SGaleotti, NGhelardini, CRomanelli, MNScapecchi, STeodori, EPacini, ABartolini, AGualtieri, F Design, synthesis, and preliminary pharmacological evaluation of a set of small molecules that directly activate gi proteins. J Med Chem48:6491-503 (2005) 
 
Guanine nucleotide-binding protein G(o) subunit alpha
Name:Guanine nucleotide-binding protein G(o) subunit alpha
Type:PROTEIN
Mol. Mass.:40043.59
Organism:Homo sapiens (Human)
Description:ChEMBL_321106
Residue:354
BDBM50174643
NameBDBM50174643
Synonyms:1-Pentadecyl-4-(2-piperidin-4-yl-ethyl)-piperidine; dihydrochloride | CHEMBL534482
TypeSmall organic molecule
Emp. Form.C27H54N2
Mol. Mass.406.7311
1CCC(CCC2CCNCC2)CC1