Reaction Details
TargetGuanine nucleotide-binding protein G(i) subunit alpha-3
LigandBDBM50174642
Substrate/Competitorn/a
Meas. Tech.ChEMBL_321105 (CHEMBL882871)
EC50 6100±n/a nM
Citation Manetti, DDi Cesare Mannelli, LDei, SGaleotti, NGhelardini, CRomanelli, MNScapecchi, STeodori, EPacini, ABartolini, AGualtieri, F Design, synthesis, and preliminary pharmacological evaluation of a set of small molecules that directly activate gi proteins. J Med Chem48:6491-503 (2005) 
 
Guanine nucleotide-binding protein G(i) subunit alpha-3
Name:Guanine nucleotide-binding protein G(i) subunit alpha-3
Type:PROTEIN
Mol. Mass.:40527.21
Organism:Homo sapiens (Human)
Description:ChEMBL_321105
Residue:354
BDBM50174642
NameBDBM50174642
Synonyms:1-{4-[2-(1-Methyl-piperidin-4-yl)-ethyl]-piperidin-1-yl}-pentadecan-1-one; hydrochloride | CHEMBL536732
TypeSmall organic molecule
Emp. Form.C28H54N2O
Mol. Mass.434.7412
(=O)N1CCC(CCC2CCN(C)CC2)CC1