Reaction Details
TargetGuanine nucleotide-binding protein G(i) subunit alpha-3
LigandBDBM50174660
Substrate/Competitorn/a
Meas. Tech.ChEMBL_321105 (CHEMBL882871)
EC50 19000±n/a nM
Citation Manetti, DDi Cesare Mannelli, LDei, SGaleotti, NGhelardini, CRomanelli, MNScapecchi, STeodori, EPacini, ABartolini, AGualtieri, F Design, synthesis, and preliminary pharmacological evaluation of a set of small molecules that directly activate gi proteins. J Med Chem48:6491-503 (2005) 
 
Guanine nucleotide-binding protein G(i) subunit alpha-3
Name:Guanine nucleotide-binding protein G(i) subunit alpha-3
Type:PROTEIN
Mol. Mass.:40527.21
Organism:Homo sapiens (Human)
Description:ChEMBL_321105
Residue:354
BDBM50174660
NameBDBM50174660
Synonyms:1-(2-Amino-ethyl)-piperidine-4-carboxylic acid pentadecylamide; dihydrochloride | CHEMBL537856
TypeSmall organic molecule
Emp. Form.C23H47N3O
Mol. Mass.381.6388
(=O)C1CCN(CCN)CC1