Reaction Details
TargetSodium-dependent serotonin transporter
LigandBDBM50109061
Substrate/Competitorn/a
Meas. Tech.ChEMBL_320752 (CHEMBL881225)
Ki 1.5±n/a nM
Citation Morphy, RRankovic, Z Designed multiple ligands. An emerging drug discovery paradigm. J Med Chem48:6523-43 (2005) 
 
Sodium-dependent serotonin transporter
Name:Sodium-dependent serotonin transporter
Type:Multi-pass membrane protein
Mol. Mass.:70322.51
Organism:Homo sapiens (Human)
Description:P31645
Residue:630
BDBM50109061
NameBDBM50109061
Synonyms:3-{1-[2-(1H-Indol-4-yloxy)-ethyl]-1,2,3,6-tetrahydro-pyridin-4-yl}-1H-pyrrolo[2,3-b]pyridine | CHEMBL104229
TypeSmall organic molecule
Emp. Form.C22H22N4O
Mol. Mass.358.4363
SMILESC(CN1CCC(=CC1)c1c[nH]c2ncccc12)Oc1cccc2[nH]ccc12