Reaction Details
TargetType-1 angiotensin II receptor
LigandBDBM50175523
Substrate/Competitorn/a
Meas. Tech.ChEMBL_321233 (CHEMBL881768)
Ki 0.800000±n/a nM
Citation Morphy, RRankovic, Z Designed multiple ligands. An emerging drug discovery paradigm. J Med Chem48:6523-43 (2005) 
 
Type-1 angiotensin II receptor
Name:Type-1 angiotensin II receptor
Type:Protein
Mol. Mass.:41080.75
Organism:Homo sapiens (Human)
Description:P30556
Residue:359
BDBM50175523
NameBDBM50175523
Synonyms:4''-(2-Butyl-4-oxo-1,3-diaza-spiro[4.4]non-1-en-3-ylmethyl)-2''-ethoxymethyl-biphenyl-2-sulfonic acid (4,5-dimethyl-isoxazol-3-yl)-amide CHEMBL539423
TypeSmall organic molecule
Emp. Form.C32H40N4O5S
Mol. Mass.592.749
SMILESCCCCC1=NC2(CCCC2)C(=O)N1Cc1ccc(c(COCC)c1)-c1ccccc1S(=O)(=O)Nc1noc(C)c1C