Reaction Details
TargetHistamine H1 receptor
LigandBDBM50002088
Substrate/Competitorn/a
Meas. Tech.ChEMBL_320749 (CHEMBL881222)
Ki 11±n/a nM
Citation Morphy, RRankovic, Z Designed multiple ligands. An emerging drug discovery paradigm. J Med Chem48:6523-43 (2005) 
 
Histamine H1 receptor
Name:Histamine H1 receptor
Type:G Protein-Coupled Receptor (GPCR)
Mol. Mass.:55808.72
Organism:Homo sapiens (Human)
Description:Cell pellets from SK-N-MC cells transfected with human H1 receptor were used in binding assay.
Residue:487
BDBM50002088
NameBDBM50002088
Synonyms:CHEMBL302005 | [11-(2-Dimethylamino-ethylidene)-6,11-dihydro-dibenzo[b,e]oxepin-2-yl]-acetic acid
TypeSmall organic molecule
Emp. Form.C20H21NO3
Mol. Mass.323.3856
SMILESCN(C)C\C=C1/c2ccccc2COc2ccc(CC(O)=O)cc12