Reaction Details
TargetThromboxane A2 receptor
LigandBDBM50175524
Substrate/Competitorn/a
Meas. Tech.ChEMBL_320829 (CHEMBL871671)
Ki 15±n/a nM
Citation Morphy, RRankovic, Z Designed multiple ligands. An emerging drug discovery paradigm. J Med Chem48:6523-43 (2005) 
 
Thromboxane A2 receptor
Name:Thromboxane A2 receptor
Type:Enyzme
Mol. Mass.:37445.28
Organism:Homo sapiens (Human)
Description:P21731
Residue:343
BDBM50175524
NameBDBM50175524
Synonyms:11-[2-Benzoimidazol-1-yl-eth-(E)-ylidene]-6,11-dihydro-dibenzo[b,e]oxepine-2-carboxylic acid | CHEMBL198104
TypeSmall organic molecule
Emp. Form.C24H18N2O3
Mol. Mass.382.4113
SMILESOC(=O)c1ccc2OCc3ccccc3\C(=C/Cn3cnc4ccccc34)c2c1