Reaction Details
TargetPeroxisome proliferator-activated receptor delta
LigandBDBM50122340
Substrate/Competitorn/a
Meas. Tech.ChEMBL_320734 (CHEMBL881207)
Kd 5700±n/a nM
Citation Morphy, RRankovic, Z Designed multiple ligands. An emerging drug discovery paradigm. J Med Chem48:6523-43 (2005) 
 
Peroxisome proliferator-activated receptor delta
Name:Peroxisome proliferator-activated receptor delta
Type:Enzyme
Mol. Mass.:49910.45
Organism:Homo sapiens (Human)
Description:Q03181
Residue:441
BDBM50122340
NameBDBM50122340
Synonyms:(S)-3-[4-(3,3-Diphenyl-allyloxy)-phenyl]-2-ethoxy-propionic acid | CHEMBL314483
TypeSmall organic molecule
Emp. Form.C26H26O4
Mol. Mass.402.4822
SMILES[#6]-[#6]-[#8]-[#6@@H](-[#6]-c1ccc(-[#8]-[#6]\[#6]=[#6](/c2ccccc2)-c2ccccc2)cc1)-[#6](-[#8])=O