Reaction Details
TargetNeprilysin
LigandBDBM50175518
Substrate/Competitorn/a
Meas. Tech.ChEMBL_321178 (CHEMBL882907)
IC50 0.080000±n/a nM
Citation Morphy, RRankovic, Z Designed multiple ligands. An emerging drug discovery paradigm. J Med Chem48:6523-43 (2005) 
 
Neprilysin
Name:Neprilysin
Type:Enzyme
Mol. Mass.:85505.38
Organism:Homo sapiens (Human)
Description:P08473
Residue:750
BDBM50175518
NameBDBM50175518
Synonyms:(3R,7S)-7-((R)-2-Mercapto-3-phenyl-propionylamino)-6-oxo-1,2,3,4,6,7,8,12b-octahydro-benzo[c]pyrido[1,2-a]azepine-4-carboxylic acid | CHEMBL198316
TypeSmall organic molecule
Emp. Form.C24H26N2O4S
Mol. Mass.438.539
SMILESOC(=O)[C@H]1CCCC2N1C(=O)[C@H](Cc1ccccc21)NC(=O)[C@H](S)Cc1ccccc1