Reaction Details
TargetGamma-aminobutyric acid receptor subunit alpha-1
LigandBDBM23183
Substrate/Competitorn/a
Meas. Tech.ChEMBL_321555 (CHEMBL881969)
IC50 16±n/a nM
Citation Minetti, PTinti, MOCarminati, PCastorina, MDi Cesare, MADi Serio, SGallo, GGhirardi, OGiorgi, FGiorgi, LPiersanti, GBartoccini, FTarzia, G 2-n-Butyl-9-methyl-8-[1,2,3]triazol-2-yl-9H-purin-6-ylamine and analogues as A2A adenosine receptor antagonists. Design, synthesis, and pharmacological characterization. J Med Chem48:6887-96 (2005) 
 
Gamma-aminobutyric acid receptor subunit alpha-1
Name:Gamma-aminobutyric acid receptor subunit alpha-1
Type:Enzyme
Mol. Mass.:51770.21
Organism:Rattus norvegicus (Rat)
Description:P62813
Residue:455
BDBM23183
NameBDBM23183
Synonyms:5-(aminomethyl)-1,2-oxazol-3-ol CHEMBL273481 Pantherine
TypeGABA Agonist
Emp. Form.C4H6N2O2
Mol. Mass.114.1026
SMILESNCc1cc(=O)[nH]o1