Reaction Details
TargetAdenosine receptor A2b
LigandBDBM82038
Substrate/Competitorn/a
Meas. Tech.ChEMBL_321017 (CHEMBL883650)
Ki 3.8±n/a nM
Citation Minetti, PTinti, MOCarminati, PCastorina, MDi Cesare, MADi Serio, SGallo, GGhirardi, OGiorgi, FGiorgi, LPiersanti, GBartoccini, FTarzia, G 2-n-Butyl-9-methyl-8-[1,2,3]triazol-2-yl-9H-purin-6-ylamine and analogues as A2A adenosine receptor antagonists. Design, synthesis, and pharmacological characterization. J Med Chem48:6887-96 (2005) 
 
Adenosine receptor A2b
Name:Adenosine receptor A2b
Type:G Protein-Coupled Receptor (GPCR)
Mol. Mass.:36341.22
Organism:Homo sapiens (Human)
Description:n/a
Residue:332
BDBM82038
NameBDBM82038
Synonyms:Alloxazine CHEMBL68500 cid_5372720
TypeSmall organic molecule
Emp. Form.C10H6N4O2
Mol. Mass.214.1802
SMILESO=c1[nH]c2nc3ccccc3nc2c(=O)[nH]1