Reaction Details
TargetMuscarinic acetylcholine receptor M2
LigandBDBM50064176
Substrate/Competitorn/a
Meas. Tech.ChEMBL_321555 (CHEMBL881969)
IC50 34±n/a nM
Citation Minetti, PTinti, MOCarminati, PCastorina, MDi Cesare, MADi Serio, SGallo, GGhirardi, OGiorgi, FGiorgi, LPiersanti, GBartoccini, FTarzia, G 2-n-Butyl-9-methyl-8-[1,2,3]triazol-2-yl-9H-purin-6-ylamine and analogues as A2A adenosine receptor antagonists. Design, synthesis, and pharmacological characterization. J Med Chem48:6887-96 (2005) 
 
Muscarinic acetylcholine receptor M2
Name:Muscarinic acetylcholine receptor M2
Type:Enzyme Catalytic Domain
Mol. Mass.:51555.53
Organism:RAT
Description:P10980
Residue:466
BDBM50064176
NameBDBM50064176
Synonyms:CHEMBL27673 METHOCTRAMINE N1,N8-bis(6-(2-methoxybenzylamino)hexyl)octane-1,8-diamine
TypeSmall organic molecule
Emp. Form.C36H62N4O2
Mol. Mass.582.9031
SMILESCOc1ccccc1CNCCCCCCNCCCCCCCCNCCCCCCNCc1ccccc1OC