Reaction Details
TargetAdenosine receptor A2a
LigandBDBM50176054
Substrate/Competitorn/a
Meas. Tech.ChEMBL_321018 (CHEMBL883651)
Ki 120±n/a nM
Citation Minetti, PTinti, MOCarminati, PCastorina, MDi Cesare, MADi Serio, SGallo, GGhirardi, OGiorgi, FGiorgi, LPiersanti, GBartoccini, FTarzia, G 2-n-Butyl-9-methyl-8-[1,2,3]triazol-2-yl-9H-purin-6-ylamine and analogues as A2A adenosine receptor antagonists. Design, synthesis, and pharmacological characterization. J Med Chem48:6887-96 (2005) 
 
Adenosine receptor A2a
Name:Adenosine receptor A2a
Type:G Protein-Coupled Receptor (GPCR)
Mol. Mass.:44716.46
Organism:Homo sapiens (Human)
Description:P29274
Residue:412
BDBM50176054
NameBDBM50176054
Synonyms:1,6-Dimethyl-2-[1,2,3]triazol-2-yl-1H-imidazo[4,5-c]pyridin-4-ylamine | CHEMBL197682
TypeSmall organic molecule
Emp. Form.C10H11N7
Mol. Mass.229.2412
SMILESCc1cc2n(C)c(nc2c(N)n1)-n1nccn1