Reaction Details
TargetAdenosine receptor A2a
LigandBDBM50176063
Substrate/Competitorn/a
Meas. Tech.ChEMBL_321018 (CHEMBL883651)
Ki 70±n/a nM
Citation Minetti, PTinti, MOCarminati, PCastorina, MDi Cesare, MADi Serio, SGallo, GGhirardi, OGiorgi, FGiorgi, LPiersanti, GBartoccini, FTarzia, G 2-n-Butyl-9-methyl-8-[1,2,3]triazol-2-yl-9H-purin-6-ylamine and analogues as A2A adenosine receptor antagonists. Design, synthesis, and pharmacological characterization. J Med Chem48:6887-96 (2005) 
 
Adenosine receptor A2a
Name:Adenosine receptor A2a
Type:G Protein-Coupled Receptor (GPCR)
Mol. Mass.:44716.46
Organism:Homo sapiens (Human)
Description:P29274
Residue:412
BDBM50176063
NameBDBM50176063
Synonyms:2,9-Dimethyl-8-[1,2,3]triazol-2-yl-9H-purin-6-ylamine | CHEMBL194290
TypeSmall organic molecule
Emp. Form.C9H10N8
Mol. Mass.230.2293
SMILESCc1nc(N)c2nc(-n3nccn3)n(C)c2n1