Reaction Details
TargetVasopressin V1a receptor
LigandBDBM50178186
Substrate/Competitorn/a
Meas. Tech.ChEMBL_326539 (CHEMBL863357)
Ki 650±n/a nM
Citation Quattropani, ADorbais, JCovini, DPittet, PAColovray, VThomas, RJCoxhead, RHalazy, SScheer, AMissotten, MAyala, GBradshaw, CDe Raemy-Schenk, AMNichols, ACirillo, RTos, EGGiachetti, CGolzio, LMarinelli, PChurch, DJBarberis, CChollet, ASchwarz, MK Discovery and development of a new class of potent, selective, orally active oxytocin receptor antagonists. J Med Chem48:7882-905 (2005) 
 
Vasopressin V1a receptor
Name:Vasopressin V1a receptor
Type:Receptor
Mol. Mass.:46820.18
Organism:Homo sapiens (Human)
Description:P37288
Residue:418
BDBM50178186
NameBDBM50178186
Synonyms:CHEMBL372122 | N-(4-chlorophenyl)-4-ethoxy-N-{2-[(2E)-2-(2-hydroxybenzylidene)hydrazino]-2-oxoethyl}benzenesulfonamide
TypeSmall organic molecule
Emp. Form.C23H22ClN3O5S
Mol. Mass.487.956
SMILESCCOc1ccc(cc1)S(=O)(=O)N(CC(=O)NN=Cc1ccccc1O)c1ccc(Cl)cc1