Reaction Details
TargetOxytocin receptor
LigandBDBM50410619
Substrate/Competitorn/a
Meas. Tech.ChEMBL_326541 (CHEMBL863361)
Ki 12±n/a nM
Citation Quattropani, ADorbais, JCovini, DPittet, PAColovray, VThomas, RJCoxhead, RHalazy, SScheer, AMissotten, MAyala, GBradshaw, CDe Raemy-Schenk, AMNichols, ACirillo, RTos, EGGiachetti, CGolzio, LMarinelli, PChurch, DJBarberis, CChollet, ASchwarz, MK Discovery and development of a new class of potent, selective, orally active oxytocin receptor antagonists. J Med Chem48:7882-905 (2005) 
 
Oxytocin receptor
Name:Oxytocin receptor
Type:Enzyme Catalytic Domain
Mol. Mass.:42889.28
Organism:RAT
Description:Oxytocin OXTR RAT::P70536
Residue:388
BDBM50410619
NameBDBM50410619
Synonyms:CHEMBL2113208
TypeSmall organic molecule
Emp. Form.C27H27ClN4O7S
Mol. Mass.587.044
SMILESCOCCOCCOc1ccc(cc1)S(=O)(=O)N(CC(=O)N\N=C1/C(=O)Nc2ccccc12)c1ccc(Cl)cc1