Reaction Details
TargetOxytocin receptor
LigandBDBM50410635
Substrate/Competitorn/a
Meas. Tech.ChEMBL_326541 (CHEMBL863361)
Ki 33±n/a nM
Citation Quattropani, ADorbais, JCovini, DPittet, PAColovray, VThomas, RJCoxhead, RHalazy, SScheer, AMissotten, MAyala, GBradshaw, CDe Raemy-Schenk, AMNichols, ACirillo, RTos, EGGiachetti, CGolzio, LMarinelli, PChurch, DJBarberis, CChollet, ASchwarz, MK Discovery and development of a new class of potent, selective, orally active oxytocin receptor antagonists. J Med Chem48:7882-905 (2005) 
 
Oxytocin receptor
Name:Oxytocin receptor
Type:Enzyme Catalytic Domain
Mol. Mass.:42889.28
Organism:RAT
Description:Oxytocin OXTR RAT::P70536
Residue:388
BDBM50410635
NameBDBM50410635
Synonyms:CHEMBL2113211
TypeSmall organic molecule
Emp. Form.C25H23ClN4O6S
Mol. Mass.542.991
SMILESCOCCOc1ccc(cc1)S(=O)(=O)N(CC(=O)N\N=C1/C(=O)Nc2ccccc12)c1ccc(Cl)cc1