Reaction Details
TargetSterol O-acyltransferase 1
LigandBDBM50175769
Substrate/Competitorn/a
Meas. Tech.ChEMBL_328123 (CHEMBL863930)
IC50 382±n/a nM
Citation Ban, HMuraoka, MIoriya, KOhashi, N Synthesis and biological activity of novel 4-phenyl-1,8-naphthyridin-2(1H)-on-3-yl ureas: potent acyl-CoA:cholesterol acyltransferase inhibitor with improved aqueous solubility. Bioorg Med Chem Lett16:44-8 (2005) 
 
Sterol O-acyltransferase 1
Name:Sterol O-acyltransferase 1
Type:PROTEIN
Mol. Mass.:64165.56
Organism:Rattus norvegicus
Description:ChEMBL_28796
Residue:545
BDBM50175769
NameBDBM50175769
Synonyms:1-(4-(aminomethyl)-2,6-diisopropylphenyl)-3-(1-butyl-4-(3-methoxyphenyl)-2-oxo-1,2-dihydro-1,8-naphthyridin-3-yl)urea hydrochloride | CHEMBL558774
TypeSmall organic molecule
Emp. Form.C33H41N5O3
Mol. Mass.555.7103
SMILESCCCCn1c2ncccc2c(-c2cccc(OC)c2)c(NC(=O)Nc2c(cc(CN)cc2C(C)C)C(C)C)c1=O